Share
View previous topicGo downView next topic
avatar
Posts : 12
Points : 22
Join date : 2017-12-11
View user profile

Compiling problem

on Wed Dec 13, 2017 12:28 pm
Hi

Something has happened to the source. I cannot compile the last versions.

I have reinstalled my Qt and it is version 5.10.0
During the compile tests I have deleted the destination directory before a new test.
The first failing one is 5328

--TImo

Version 5331
cp: directory /Volumes/D128/valentina-prog/src/app/tape/bin/tape.app/Contents/Resources does not exist
make[3]: *** [bin/tape] Error 1
make[2]: *** [sub-tape-make_first] Error 2
make[1]: *** [sub-app-make_first] Error 2
make: *** [sub-src-make_first] Error 2
09:21:02: The process "/usr/bin/make" exited with code 2.
Error while building/deploying project Valentina (kit: Desktop Qt 5.10.0 clang 64bit)
When executing step "Make"
09:21:02: Elapsed time: 21:03.

Version 5328
cp: directory /Volumes/D128/valentina-prog/src/app/tape/bin/tape.app/Contents/Resources does not exist
make[3]: *** [bin/tape] Error 1
make[2]: *** [sub-tape-make_first] Error 2
make[1]: *** [sub-app-make_first] Error 2
make: *** [sub-src-make_first] Error 2
09:46:18: The process "/usr/bin/make" exited with code 2.
Error while building/deploying project Valentina (kit: Desktop Qt 5.10.0 clang 64bit)
When executing step "Make"
09:46:18: Elapsed time: 20:40.

Versio 5327 OK
Versio 5326 OK
Versio 5324 OK

avatar
Posts : 12
Points : 22
Join date : 2017-12-11
View user profile

Re: Compiling problem

on Wed Dec 13, 2017 8:04 pm
I was compiling in debug mode. I should use release mode.
Now it works.
View previous topicBack to topView next topic
Permissions in this forum:
You cannot reply to topics in this forum